{"text_format":"1","workbook":"xlsx","n_sheets":7,"sheets":["Lisez-moi","Service Extrascolaire","Service Accueil Adolescents","Service Périscolaire Mixte","Identification","Insee","Feuil1"],"not_rendered":{"charts":0,"images":1,"macros":1,"external_links":2,"defined_names":31,"comments":3,"pivot_tables":0},"unopened":[],"bounds":{"document_bytes":16777216,"sheet_cells":100000,"rows_first":2000,"rows_last":500,"rows_between":2000,"halvings":0,"cell_chars":16384,"cell_head_chars":4096},"cells_cut":0,"cells_raw":0,"read":"whole","date_system":"1900"}

{"sheet":"Lisez-moi","index":0,"n_rows":94,"n_cols":1,"rows_kept":94,"cut":false,"hidden":false,"merged":[]}
["Lisez-moi"]
[]
["Ce fichier va vous permettre de déclarer vos données d'activité actualisées 2018 pour votre ALSH"]
[]
["Ce fichier est conçu pour prendre en compte tous les types de services :"]
[]
[" - Périscolaire MIXTE (Hors TAP + TAP)"]
[" - Extrascolaire "]
[" - Accueil Adolescents"]
[]
["Il est fortement conseillé de sauvegarder ce fichier après chaque modification, avec le format suivant :"]
["nom de l'équipement/type déclaration/version.xls"]
[]
["1) Pour compléter votre déclaration actualisée 2018, vous devez en premier lieu choisir le service proposé par votre équipement"]
[]
[]
["2) Choisissez votre type de service entre :"]
[]
["● Mon service Périscolaire Mixte"]
["● Mon service Extrascolaire"]
["● Mon service Accueil Adolescents"]
[]
[]
["3) Chaque feuille de calcul est composée de 5 parties:"]
[]
["A) - Identification du partenaire"]
["B) - Lieux d'implantation du service"]
["C) - Déclaration des données d'activité"]
["D) - Zone \"Commentaires\""]
["E) - Validation de la déclaration de données avant transmission à la Caf"]
{"$rows_left_out":65}
{"sheet":"Service Extrascolaire","index":1,"n_rows":134,"n_cols":10,"rows_kept":134,"cut":false,"hidden":false,"merged":[[0,0,0,3],[0,5,0,7],[65,6,65,7],[65,8,65,9],[124,4,125,4],[57,1,57,2],[133,4,134,6],[21,4,21,6],[22,0,22,2],[22,4,22,6],[23,0,23,2],[23,4,23,6],[19,4,19,6],[20,0,20,2],[20,4,20,6],[24,0,24,2],[19,0,19,2],[54,1,54,6],[55,1,55,6],[51,1,51,2],[52,1,52,2],[56,1,56,2],[25,0,25,2],[53,1,53,6],[135,4,137,6],[123,1,123,3],[124,0,125,0],[124,1,125,3],[124,5,125,7],[131,0,131,3],[9,0,9,1],[3,1,3,6],[5,1,5,5],[9,2,9,6],[11,0,11,1],[6,6,6,7],[7,0,7,1],[11,4,11,5],[18,0,18,2],[18,4,18,6],[15,0,15,7],[16,0,16,2],[16,4,16,6],[17,0,17,2],[17,4,17,6],[24,4,24,6],[21,0,21,2],[130,0,130,3],[34,0,34,2],[42,0,42,2],[43,0,43,2],[42,4,42,6],[50,2,50,3],[44,0,44,2],[45,0,45,2],[46,0,46,2],[38,0,38,2],[39,0,39,2],[49,2,49,3],[49,4,49,5],[49,6,49,7],[40,0,40,2],[41,0,41,2],[38,4,38,6],[39,4,39,6],[40,4,40,6],[41,4,41,6],[50,6,50,7],[43,4,43,6],[44,4,44,6],[45,4,45,6],[46,4,46,6],[25,4,25,6],[26,0,26,2],[27,0,27,2],[28,0,28,2],[36,0,36,2],[37,0,37,2],[29,0,29,2],[29,4,29,6],[30,0,30,2],[30,4,30,6],[31,0,31,2],[31,4,31,6],[32,0,32,2],[32,4,32,6],[33,0,33,2],[33,4,33,6],[26,4,26,6],[27,4,27,6],[35,0,35,2],[28,4,28,6],[36,4,36,6],[37,4,37,6],[34,4,34,6],[35,4,35,6],[49,0,49,1],[50,0,50,1],[50,4,50,5],[75,0,75,1],[76,0,76,1],[77,0,77,1],[78,0,78,1],[65,2,66,3],[67,2,67,3],[68,2,68,3],[69,2,69,3],[70,2,70,3],[71,2,71,3],[72,2,72,3],[73,2,73,3],[74,2,74,3],[79,0,79,1],[80,0,80,1],[81,0,81,1],[64,0,64,1],[59,0,59,9],[61,0,61,9],[65,0,66,1],[67,0,67,1],[68,0,68,1],[69,0,69,1],[70,0,70,1],[71,0,71,1],[72,0,72,1],[73,0,73,1],[74,0,74,1],[62,0,62,5],[62,6,62,7],[75,2,75,3],[76,2,76,3],[77,2,77,3],[78,2,78,3],[79,2,79,3],[80,2,80,3],[81,2,81,3],[84,2,84,3],[85,2,85,3],[86,2,86,3],[87,2,87,3],[88,2,88,3],[82,0,82,1],[83,0,83,1],[84,0,84,1],[85,0,85,1],[86,0,86,1],[87,0,87,1],[88,0,88,1],[82,2,82,3],[83,2,83,3],[108,0,117,9],[107,1,107,9],[89,2,89,3],[90,2,90,3],[91,2,91,3],[92,2,92,3],[93,2,93,3],[94,2,94,3],[95,2,95,3],[96,2,96,3],[97,0,97,3],[91,0,91,1],[92,0,92,1],[93,0,93,1],[94,0,94,1],[95,0,95,1],[96,0,96,1],[89,0,89,1],[90,0,90,1]]}
["ALSH EXTRASCOLAIRE",null,null,null,null,"ACTIVITE 2018 ACTUALISEE A FIN"]
[null,null,null,null,null,null,null,"SEPTEMBRE"]
[]
["GESTIONNAIRE",{"$f":"IF($H$6=\"\",\"\",VLOOKUP(H6,Identification!A2:G83,2))","v":""}]
[]
["EQUIPEMENT",{"$f":"IF($H$6=\"\",\"\",VLOOKUP(H6,Identification!A2:G83,3))","v":""},null,null,null,null,"DOSSIER N°"]
[]
["Code Postal de la commune de l'équipement"]
[]
["COMMUNE DE L'EQUIPEMENT"]
[]
["Code Insee de la commune",null,{"$f":"IF(C10=\"\",\"\",VLOOKUP(C10,resultat,3))","v":""},null,"Taux RG conventionné",null,0.99]
[]
[]
[]
["LIEUX D'IMPLANTATION"]
["Adresse",null,null,"Code postal","Commune",null,null,"Code Insee commune"]
[null,null,null,null,null,null,null,{"$f":"INDEX(Insee!$C$1:$C$38001,MAX(IF((D18=Insee!$B$1:$B$38001)*(E18=Insee!$A$1:$A$38001),ROW(Insee!$C$1:$C$38001),0)))","v":0}]
[null,null,null,null,null,null,null,{"$f":"INDEX(Insee!$C$1:$C$38001,MAX(IF((D19=Insee!$B$1:$B$38001)*(E19=Insee!$A$1:$A$38001),ROW(Insee!$C$1:$C$38001),0)))","v":0}]
[null,null,null,null,null,null,null,{"$f":"INDEX(Insee!$C$1:$C$38001,MAX(IF((D20=Insee!$B$1:$B$38001)*(E20=Insee!$A$1:$A$38001),ROW(Insee!$C$1:$C$38001),0)))","v":0}]
[null,null,null,null,null,null,null,{"$f":"INDEX(Insee!$C$1:$C$38001,MAX(IF((D21=Insee!$B$1:$B$38001)*(E21=Insee!$A$1:$A$38001),ROW(Insee!$C$1:$C$38001),0)))","v":0}]
[null,null,null,null,null,null,null,{"$f":"INDEX(Insee!$C$1:$C$38001,MAX(IF((D22=Insee!$B$1:$B$38001)*(E22=Insee!$A$1:$A$38001),ROW(Insee!$C$1:$C$38001),0)))","v":0}]
[null,null,null,null,null,null,null,{"$f":"INDEX(Insee!$C$1:$C$38001,MAX(IF((D23=Insee!$B$1:$B$38001)*(E23=Insee!$A$1:$A$38001),ROW(Insee!$C$1:$C$38001),0)))","v":0}]
[null,null,null,null,null,null,null,{"$f":"INDEX(Insee!$C$1:$C$38001,MAX(IF((D24=Insee!$B$1:$B$38001)*(E24=Insee!$A$1:$A$38001),ROW(Insee!$C$1:$C$38001),0)))","v":0}]
[null,null,null,null,null,null,null,{"$f":"INDEX(Insee!$C$1:$C$38001,MAX(IF((D25=Insee!$B$1:$B$38001)*(E25=Insee!$A$1:$A$38001),ROW(Insee!$C$1:$C$38001),0)))","v":0}]
[null,null,null,null,null,null,null,{"$f":"INDEX(Insee!$C$1:$C$38001,MAX(IF((D26=Insee!$B$1:$B$38001)*(E26=Insee!$A$1:$A$38001),ROW(Insee!$C$1:$C$38001),0)))","v":0}]
[null,null,null,null,null,null,null,{"$f":"INDEX(Insee!$C$1:$C$38001,MAX(IF((D27=Insee!$B$1:$B$38001)*(E27=Insee!$A$1:$A$38001),ROW(Insee!$C$1:$C$38001),0)))","v":0}]
[null,null,null,null,null,null,null,{"$f":"INDEX(Insee!$C$1:$C$38001,MAX(IF((D28=Insee!$B$1:$B$38001)*(E28=Insee!$A$1:$A$38001),ROW(Insee!$C$1:$C$38001),0)))","v":0}]
[null,null,null,null,null,null,null,{"$f":"INDEX(Insee!$C$1:$C$38001,MAX(IF((D29=Insee!$B$1:$B$38001)*(E29=Insee!$A$1:$A$38001),ROW(Insee!$C$1:$C$38001),0)))","v":0}]
[null,null,null,null,null,null,null,{"$f":"INDEX(Insee!$C$1:$C$38001,MAX(IF((D30=Insee!$B$1:$B$38001)*(E30=Insee!$A$1:$A$38001),ROW(Insee!$C$1:$C$38001),0)))","v":0}]
{"$rows_left_out":105}
{"sheet":"Service Accueil Adolescents","index":2,"n_rows":137,"n_cols":11,"rows_kept":137,"cut":false,"hidden":false,"merged":[[65,10,66,10],[136,4,137,6],[49,6,49,7],[45,4,45,6],[45,0,45,2],[46,0,46,2],[50,2,50,3],[49,0,49,1],[138,4,140,6],[126,0,127,0],[126,1,127,3],[126,4,127,4],[126,5,127,7],[125,1,125,3],[133,0,133,3],[129,1,129,6],[49,4,49,5],[50,6,50,7],[51,1,51,2],[52,1,52,2],[53,1,53,6],[54,1,54,6],[55,1,55,6],[56,1,56,2],[62,6,62,7],[0,0,0,3],[0,5,0,7],[43,0,43,2],[44,0,44,2],[42,0,42,2],[37,0,37,2],[37,4,37,6],[22,0,22,2],[38,4,38,6],[41,0,41,2],[40,4,40,6],[41,4,41,6],[42,4,42,6],[43,4,43,6],[44,4,44,6],[16,4,16,6],[36,0,36,2],[36,4,36,6],[34,0,34,2],[34,4,34,6],[6,6,6,7],[3,1,3,6],[5,1,5,5],[18,0,18,2],[18,4,18,6],[7,0,7,1],[9,0,9,1],[9,2,9,6],[11,0,11,1],[11,4,11,5],[24,4,24,6],[25,0,25,2],[25,4,25,6],[23,0,23,2],[23,4,23,6],[15,0,15,7],[17,0,17,2],[17,4,17,6],[21,0,21,2],[21,4,21,6],[19,0,19,2],[19,4,19,6],[20,0,20,2],[20,4,20,6],[16,0,16,2],[22,4,22,6],[35,4,35,6],[26,4,26,6],[27,0,27,2],[27,4,27,6],[24,0,24,2],[26,0,26,2],[50,4,50,5],[50,0,50,1],[38,0,38,2],[46,4,46,6],[39,0,39,2],[40,0,40,2],[39,4,39,6],[49,2,49,3],[30,0,30,2],[30,4,30,6],[31,0,31,2],[31,4,31,6],[32,0,32,2],[32,4,32,6],[33,0,33,2],[33,4,33,6],[28,0,28,2],[28,4,28,6],[72,0,72,1],[72,2,72,3],[73,0,73,1],[73,2,73,3],[74,0,74,1],[74,2,74,3],[74,4,74,5],[74,6,74,7],[67,0,67,1],[67,2,67,3],[68,0,68,1],[68,2,68,3],[69,0,69,1],[69,2,69,3],[70,0,70,1],[70,2,70,3],[71,0,71,1],[71,2,71,3],[68,6,68,7],[29,0,29,2],[29,4,29,6],[35,0,35,2],[73,4,73,5],[73,6,73,7],[73,8,73,9],[75,0,75,1],[75,2,75,3],[76,0,76,1],[76,2,76,3],[70,4,70,5],[70,6,70,7],[70,8,70,9],[71,4,71,5],[71,6,71,7],[71,8,71,9],[72,4,72,5],[72,6,72,7],[72,8,72,9],[65,6,66,7],[65,8,66,9],[67,4,67,5],[68,4,68,5],[67,6,67,7],[80,0,80,1],[80,2,80,3],[81,0,81,1],[81,2,81,3],[82,0,82,1],[82,2,82,3],[83,0,83,1],[83,2,83,3],[84,0,84,1],[67,8,67,9],[68,8,68,9],[69,4,69,5],[69,6,69,7],[69,8,69,9],[74,8,74,9],[75,4,75,5],[75,6,75,7],[75,8,75,9],[76,4,76,5],[76,6,76,7],[76,8,76,9],[77,4,77,5],[77,6,77,7],[77,8,77,9],[78,4,78,5],[78,6,78,7],[78,8,78,9],[84,4,84,5],[84,6,84,7],[84,8,84,9],[79,8,79,9],[80,8,80,9],[81,8,81,9],[82,8,82,9],[83,8,83,9],[88,6,88,7],[88,8,88,9],[89,4,89,5],[89,6,89,7],[89,8,89,9],[90,4,90,5],[90,6,90,7],[90,8,90,9],[85,4,85,5],[85,6,85,7],[85,8,85,9],[86,4,86,5],[86,6,86,7],[86,8,86,9],[87,4,87,5],[87,6,87,7],[87,8,87,9],[97,4,97,5],[97,6,97,7],[97,8,97,9],[65,4,65,5],[66,4,66,5],[94,4,94,5],[94,6,94,7],[94,8,94,9],[95,4,95,5],[95,6,95,7],[95,8,95,9],[96,4,96,5],[96,6,96,7],[96,8,96,9],[91,4,91,5],[91,6,91,7],[91,8,91,9],[92,4,92,5],[92,6,92,7],[92,8,92,9],[93,4,93,5],[93,6,93,7],[93,8,93,9],[88,4,88,5],[65,0,66,1],[65,2,66,3],[92,0,92,1],[87,0,87,1],[87,2,87,3],[88,0,88,1],[88,2,88,3],[89,0,89,1],[89,2,89,3],[90,0,90,1],[90,2,90,3],[91,0,91,1],[91,2,91,3],[86,0,86,1],[86,2,86,3],[84,2,84,3],[85,0,85,1],[85,2,85,3],[77,0,77,1],[77,2,77,3],[78,0,78,1],[78,2,78,3],[79,0,79,1],[79,2,79,3],[107,1,107,9],[108,0,117,9],[97,0,97,3],[59,0,59,9],[61,0,61,9],[92,2,92,3],[93,0,93,1],[93,2,93,3],[94,0,94,1],[94,2,94,3],[95,0,95,1],[95,2,95,3],[96,0,96,1],[96,2,96,3],[79,4,79,5],[79,6,79,7],[80,4,80,5],[80,6,80,7],[81,4,81,5],[81,6,81,7],[82,4,82,5],[82,6,82,7],[83,4,83,5],[83,6,83,7]]}
["ALSH ACCUEIL ADOLESCENTS",null,null,null,null,"ACTIVITE 2018 ACTUALISEE A FIN"]
[null,null,null,null,null,null,null,"SEPTEMBRE"]
[]
["GESTIONNAIRE",{"$f":"IF($H$6=\"\",\"\",VLOOKUP(H6,Identification!A151:G174,2))","v":""}]
[]
["EQUIPEMENT",{"$f":"IF($H$6=\"\",\"\",VLOOKUP(H6,Identification!A151:G174,3))","v":""},null,null,null,null,"DOSSIER N°"]
[]
["Code Postal de la commune de l'équipement"]
[]
["COMMUNE DE L'EQUIPEMENT"]
[]
["Code Insee de la commune",null,{"$f":"IF(C10=\"\",\"\",VLOOKUP(C10,resultat,3))","v":""},null,"Taux RG conventionné",null,0.99]
[]
[]
[]
["LIEUX D'IMPLANTATION"]
["Adresse",null,null,"Code postal","Commune",null,null,"Code Insee commune","Type accueil adolescents"]
[null,null,null,null,null,null,null,{"$f":"INDEX(Insee!$C$1:$C$38001,MAX(IF((D18=Insee!$B$1:$B$38001)*(E18=Insee!$A$1:$A$38001),ROW(Insee!$C$1:$C$38001),0)))","v":0},"???"]
[null,null,null,null,null,null,null,{"$f":"INDEX(Insee!$C$1:$C$38001,MAX(IF((D19=Insee!$B$1:$B$38001)*(E19=Insee!$A$1:$A$38001),ROW(Insee!$C$1:$C$38001),0)))","v":0},"???"]
[null,null,null,null,null,null,null,{"$f":"INDEX(Insee!$C$1:$C$38001,MAX(IF((D20=Insee!$B$1:$B$38001)*(E20=Insee!$A$1:$A$38001),ROW(Insee!$C$1:$C$38001),0)))","v":0},"???"]
[null,null,null,null,null,null,null,{"$f":"INDEX(Insee!$C$1:$C$38001,MAX(IF((D21=Insee!$B$1:$B$38001)*(E21=Insee!$A$1:$A$38001),ROW(Insee!$C$1:$C$38001),0)))","v":0},"???"]
[null,null,null,null,null,null,null,{"$f":"INDEX(Insee!$C$1:$C$38001,MAX(IF((D22=Insee!$B$1:$B$38001)*(E22=Insee!$A$1:$A$38001),ROW(Insee!$C$1:$C$38001),0)))","v":0},"???"]
[null,null,null,null,null,null,null,{"$f":"INDEX(Insee!$C$1:$C$38001,MAX(IF((D23=Insee!$B$1:$B$38001)*(E23=Insee!$A$1:$A$38001),ROW(Insee!$C$1:$C$38001),0)))","v":0},"???"]
[null,null,null,null,null,null,null,{"$f":"INDEX(Insee!$C$1:$C$38001,MAX(IF((D24=Insee!$B$1:$B$38001)*(E24=Insee!$A$1:$A$38001),ROW(Insee!$C$1:$C$38001),0)))","v":0},"???"]
[null,null,null,null,null,null,null,{"$f":"INDEX(Insee!$C$1:$C$38001,MAX(IF((D25=Insee!$B$1:$B$38001)*(E25=Insee!$A$1:$A$38001),ROW(Insee!$C$1:$C$38001),0)))","v":0},"???"]
[null,null,null,null,null,null,null,{"$f":"INDEX(Insee!$C$1:$C$38001,MAX(IF((D26=Insee!$B$1:$B$38001)*(E26=Insee!$A$1:$A$38001),ROW(Insee!$C$1:$C$38001),0)))","v":0},"???"]
[null,null,null,null,null,null,null,{"$f":"INDEX(Insee!$C$1:$C$38001,MAX(IF((D27=Insee!$B$1:$B$38001)*(E27=Insee!$A$1:$A$38001),ROW(Insee!$C$1:$C$38001),0)))","v":0},"???"]
[null,null,null,null,null,null,null,{"$f":"INDEX(Insee!$C$1:$C$38001,MAX(IF((D28=Insee!$B$1:$B$38001)*(E28=Insee!$A$1:$A$38001),ROW(Insee!$C$1:$C$38001),0)))","v":0},"???"]
[null,null,null,null,null,null,null,{"$f":"INDEX(Insee!$C$1:$C$38001,MAX(IF((D29=Insee!$B$1:$B$38001)*(E29=Insee!$A$1:$A$38001),ROW(Insee!$C$1:$C$38001),0)))","v":0},"???"]
[null,null,null,null,null,null,null,{"$f":"INDEX(Insee!$C$1:$C$38001,MAX(IF((D30=Insee!$B$1:$B$38001)*(E30=Insee!$A$1:$A$38001),ROW(Insee!$C$1:$C$38001),0)))","v":0},"???"]
{"$rows_left_out":108}
{"sheet":"Service Périscolaire Mixte","index":3,"n_rows":240,"n_cols":10,"rows_kept":240,"cut":false,"hidden":false,"merged":[[27,0,27,2],[27,4,27,6],[39,0,39,2],[9,0,9,1],[9,2,9,6],[11,0,11,1],[11,4,11,5],[15,0,15,7],[38,4,38,6],[29,0,29,2],[29,4,29,6],[30,0,30,2],[30,4,30,6],[31,0,31,2],[31,4,31,6],[32,0,32,2],[32,4,32,6],[33,0,33,2],[33,4,33,6],[65,8,65,9],[168,6,168,7],[168,8,168,9],[16,0,16,2],[16,4,16,6],[17,0,17,2],[17,4,17,6],[18,0,18,2],[18,4,18,6],[28,0,28,2],[28,4,28,6],[34,0,34,2],[34,4,34,6],[35,0,35,2],[35,4,35,6],[25,0,25,2],[25,4,25,6],[36,0,36,2],[36,4,36,6],[37,0,37,2],[37,4,37,6],[38,0,38,2],[26,0,26,2],[26,4,26,6],[0,0,0,3],[0,5,0,7],[22,0,22,2],[22,4,22,6],[23,0,23,2],[23,4,23,6],[24,0,24,2],[24,4,24,6],[19,0,19,2],[19,4,19,6],[20,0,20,2],[20,4,20,6],[21,0,21,2],[21,4,21,6],[3,1,3,6],[5,1,5,5],[6,6,6,7],[7,0,7,1],[42,0,42,2],[42,4,42,6],[43,0,43,2],[43,4,43,6],[44,0,44,2],[44,4,44,6],[39,4,39,6],[40,0,40,2],[40,4,40,6],[41,0,41,2],[41,4,41,6],[45,0,45,2],[45,4,45,6],[46,0,46,2],[46,4,46,6],[49,0,49,1],[49,2,49,3],[49,4,49,5],[49,6,49,7],[71,0,71,1],[71,2,71,3],[54,1,54,6],[55,1,55,6],[56,1,56,2],[59,0,59,9],[61,0,61,9],[62,6,62,7],[50,0,50,1],[50,2,50,3],[50,4,50,5],[50,6,50,7],[51,1,51,2],[52,1,52,2],[53,1,53,6],[65,6,65,7],[75,0,75,1],[75,2,75,3],[76,0,76,1],[76,2,76,3],[65,0,66,1],[65,2,66,3],[67,0,67,1],[67,2,67,3],[68,0,68,1],[68,2,68,3],[69,0,69,1],[69,2,69,3],[70,0,70,1],[70,2,70,3],[73,0,73,1],[73,2,73,3],[74,0,74,1],[74,2,74,3],[72,0,72,1],[72,2,72,3],[77,0,77,1],[77,2,77,3],[79,0,79,1],[79,2,79,3],[80,0,80,1],[80,2,80,3],[78,0,78,1],[78,2,78,3],[81,0,81,1],[81,2,81,3],[82,0,82,1],[82,2,82,3],[85,2,85,3],[117,0,117,7],[118,0,118,2],[118,4,118,6],[112,0,112,7],[83,0,83,1],[83,2,83,3],[84,0,84,1],[84,2,84,3],[85,0,85,1],[86,0,86,1],[86,2,86,3],[87,0,87,1],[87,2,87,3],[88,0,88,1],[88,2,88,3],[89,0,89,1],[89,2,89,3],[90,0,90,1],[90,2,90,3],[91,0,91,1],[91,2,91,3],[123,4,123,6],[124,4,124,6],[124,0,124,2],[125,0,125,2],[125,4,125,6],[119,0,119,2],[119,4,119,6],[120,4,120,6],[120,0,120,2],[121,4,121,6],[122,0,122,2],[122,4,122,6],[121,0,121,2],[126,4,126,6],[127,0,127,2],[127,4,127,6],[128,4,128,6],[134,0,134,2],[134,4,134,6],[138,0,138,2],[138,4,138,6],[139,0,139,2],[139,4,139,6],[129,4,129,6],[130,0,130,2],[130,4,130,6],[131,0,131,2],[131,4,131,6],[132,0,132,2],[132,4,132,6],[133,0,133,2],[133,4,133,6],[236,0,236,3],[239,4,240,6],[241,4,243,6],[228,1,228,3],[229,0,230,0],[229,1,230,3],[229,4,230,4],[229,5,230,7],[232,1,232,6],[140,4,140,6],[135,0,135,2],[135,4,135,6],[136,0,136,2],[136,4,136,6],[144,0,144,2],[144,4,144,6],[145,0,145,2],[145,4,145,6],[137,4,137,6],[137,0,137,2],[146,4,146,6],[141,0,141,2],[141,4,141,6],[142,0,142,2],[142,4,142,6],[143,0,143,2],[143,4,143,6],[152,0,152,1],[152,2,152,3],[152,4,152,5],[152,6,152,7],[147,0,147,2],[147,4,147,6],[148,0,148,2],[148,4,148,6],[151,0,151,1],[151,2,151,3],[151,4,151,5],[151,6,151,7],[165,6,165,7],[162,0,162,9],[164,0,164,9],[168,0,169,1],[168,2,169,3],[170,0,170,1],[170,2,170,3],[171,0,171,1],[171,2,171,3],[92,0,92,1],[92,2,92,3],[93,0,93,1],[93,2,93,3],[94,0,94,1],[94,2,94,3],[95,0,95,1],[95,2,95,3],[96,0,96,1],[96,2,96,3],[188,2,188,3],[97,0,97,3],[174,0,174,1],[174,2,174,3],[175,0,175,1],[175,2,175,3],[176,0,176,1],[176,2,176,3],[129,0,129,2],[172,0,172,1],[172,2,172,3],[173,0,173,1],[173,2,173,3],[146,0,146,2],[140,0,140,2],[128,0,128,2],[126,0,126,2],[123,0,123,2],[195,2,195,3],[196,0,196,1],[196,2,196,3],[197,0,197,1],[197,2,197,3],[177,0,177,1],[177,2,177,3],[178,0,178,1],[178,2,178,3],[179,0,179,1],[179,2,179,3],[180,0,180,1],[180,2,180,3],[181,0,181,1],[181,2,181,3],[184,0,184,1],[184,2,184,3],[185,0,185,1],[185,2,185,3],[186,0,186,1],[186,2,186,3],[187,0,187,1],[187,2,187,3],[188,0,188,1],[210,1,210,9],[211,0,220,9],[198,0,198,1],[198,2,198,3],[199,0,199,1],[182,0,182,1],[182,2,182,3],[183,0,183,1],[183,2,183,3],[199,2,199,3],[200,0,200,3],[189,0,189,1],[189,2,189,3],[190,0,190,1],[190,2,190,3],[191,0,191,1],[191,2,191,3],[192,0,192,1],[192,2,192,3],[193,0,193,1],[193,2,193,3],[194,0,194,1],[194,2,194,3],[195,0,195,1]]}
["ALSH PERISCOLAIRE HORS TAP",null,null,null,null,"ACTIVITE 2018 ACTUALISEE A FIN"]
[null,null,null,null,null,null,null,"SEPTEMBRE"]
[]
["GESTIONNAIRE",{"$f":"IF($H$6=\"\",\"\",VLOOKUP(H6,Identification!A84:G150,2))","v":""}]
[]
["EQUIPEMENT",{"$f":"IF($H$6=\"\",\"\",VLOOKUP(H6,Identification!A84:G150,3))","v":""},null,null,null,null,"DOSSIER N°"]
[]
["Code Postal de la commune de l'équipement",null,"?????"]
[]
["COMMUNE DE L'EQUIPEMENT"]
[]
["Code Insee de la commune",null,{"$f":"IF(C10=\"\",\"\",VLOOKUP(C10,resultat,3))","v":""},null,"Taux RG conventionné",null,0.99]
[]
[]
[]
["LIEUX D'IMPLANTATION"]
["Adresse",null,null,"Code postal","Commune",null,null,"Code Insee commune"]
[null,null,null,"?????",null,null,null,{"$f":"INDEX(Insee!$C$1:$C$38001,MAX(IF((D18=Insee!$B$1:$B$38001)*(E18=Insee!$A$1:$A$38001),ROW(Insee!$C$1:$C$38001),0)))","v":"Code INSEE"}]
[null,null,null,null,null,null,null,{"$f":"INDEX(Insee!$C$1:$C$38001,MAX(IF((D19=Insee!$B$1:$B$38001)*(E19=Insee!$A$1:$A$38001),ROW(Insee!$C$1:$C$38001),0)))","v":0}]
[null,null,null,null,null,null,null,{"$f":"INDEX(Insee!$C$1:$C$38001,MAX(IF((D20=Insee!$B$1:$B$38001)*(E20=Insee!$A$1:$A$38001),ROW(Insee!$C$1:$C$38001),0)))","v":0}]
[null,null,null,null,null,null,null,{"$f":"INDEX(Insee!$C$1:$C$38001,MAX(IF((D21=Insee!$B$1:$B$38001)*(E21=Insee!$A$1:$A$38001),ROW(Insee!$C$1:$C$38001),0)))","v":0}]
[null,null,null,null,null,null,null,{"$f":"INDEX(Insee!$C$1:$C$38001,MAX(IF((D22=Insee!$B$1:$B$38001)*(E22=Insee!$A$1:$A$38001),ROW(Insee!$C$1:$C$38001),0)))","v":0}]
[null,null,null,null,null,null,null,{"$f":"INDEX(Insee!$C$1:$C$38001,MAX(IF((D23=Insee!$B$1:$B$38001)*(E23=Insee!$A$1:$A$38001),ROW(Insee!$C$1:$C$38001),0)))","v":0}]
[null,null,null,null,null,null,null,{"$f":"INDEX(Insee!$C$1:$C$38001,MAX(IF((D24=Insee!$B$1:$B$38001)*(E24=Insee!$A$1:$A$38001),ROW(Insee!$C$1:$C$38001),0)))","v":0}]
[null,null,null,null,null,null,null,{"$f":"INDEX(Insee!$C$1:$C$38001,MAX(IF((D25=Insee!$B$1:$B$38001)*(E25=Insee!$A$1:$A$38001),ROW(Insee!$C$1:$C$38001),0)))","v":0}]
[null,null,null,null,null,null,null,{"$f":"INDEX(Insee!$C$1:$C$38001,MAX(IF((D26=Insee!$B$1:$B$38001)*(E26=Insee!$A$1:$A$38001),ROW(Insee!$C$1:$C$38001),0)))","v":0}]
[null,null,null,null,null,null,null,{"$f":"INDEX(Insee!$C$1:$C$38001,MAX(IF((D27=Insee!$B$1:$B$38001)*(E27=Insee!$A$1:$A$38001),ROW(Insee!$C$1:$C$38001),0)))","v":0}]
[null,null,null,null,null,null,null,{"$f":"INDEX(Insee!$C$1:$C$38001,MAX(IF((D28=Insee!$B$1:$B$38001)*(E28=Insee!$A$1:$A$38001),ROW(Insee!$C$1:$C$38001),0)))","v":0}]
[null,null,null,null,null,null,null,{"$f":"INDEX(Insee!$C$1:$C$38001,MAX(IF((D29=Insee!$B$1:$B$38001)*(E29=Insee!$A$1:$A$38001),ROW(Insee!$C$1:$C$38001),0)))","v":0}]
[null,null,null,null,null,null,null,{"$f":"INDEX(Insee!$C$1:$C$38001,MAX(IF((D30=Insee!$B$1:$B$38001)*(E30=Insee!$A$1:$A$38001),ROW(Insee!$C$1:$C$38001),0)))","v":0}]
{"$rows_left_out":211}
{"sheet":"Identification","index":4,"n_rows":174,"n_cols":7,"rows_kept":174,"cut":false,"hidden":true,"merged":[]}
["NUMERO DOSSIER","RAISON SOCIALE GESTIONNAIRE","NOM EQUIPEMENT","SERVICE","CODE POSTAL EQUIPEMENT","COMMUNE EQUIPEMENT","CODE INSEE COMMUNE"]
[200100001,"ASSOC CLAAC","Centre de Loisirs de Parilly","Extrascolaire","37500","CHINON","37072"]
[200100003,"ASSOC FAMILIALE AMBILLOU","Centre de Loisirs d'Ambillou","Extrascolaire","37340","AMBILLOU","37002"]
[200100007,"MAIRIE DE CHAMBRAY LES TOURS","Centre de Loisirs La Pinède","Extrascolaire","37170","CHAMBRAY LES TOURS","37050"]
[200100031,"MAIRIE DE TOURS","Centre de Loisirs La Charpraie","Extrascolaire","37170","CHAMBRAY LES TOURS","37050"]
[200100082,"MAIRIE DE NOUZILLY","Ctre Loisirs P'tites Canailles","Extrascolaire","37380","NOUZILLY","37175"]
[200100087,"MAIRIE DE ST CYR SUR LOIRE","Extra Mairie Saint Cyr","Extrascolaire","37390","METTRAY","37152"]
[200100109,"MAIRIE DE ST ANTOINE DU ROCHER","Ctre Loisirs St Antoine Rocher","Extrascolaire","37360","SAINT ANTOINE DU ROCHER","37206"]
[200200047,"MAIRIE DE CERELLES","Extra Mairie Cerelles","Extrascolaire","37390","CERELLES","37047"]
[200300310,"ASSOC FAMILLES RURALES DU RIDELLOIS","Centre de Loisirs Mermoz","Extrascolaire","37190","AZAY LE RIDEAU","37014"]
[200400119,"ASSOC SCOUTS ET GUIDES DE FRANCE","Ctre Loisirs Grpe Notre Dame","Extrascolaire","37000","TOURS","37261"]
[200400256,"MAIRIE DE PARCAY MESLAY","Ctre de Loisirs Parçay Meslay","Extrascolaire","37210","PARCAY MESLAY","37179"]
[200400258,"ASSOC REGARDS D ENFANCE","Ctre Loisirs Regards d'Enfance","Extrascolaire","37360","ROUZIERS DE TOURAINE","37204"]
[200500180,"ASSOC SCOUTS ET GUIDES DE FRANCE","Ctre Loisirs Grpe12 Christ Roi","Extrascolaire","37100","TOURS","37261"]
[200600006,"ASSOC SCOUTS ET GUIDES DE FRANCE","Centre de Loisirs Tours Sud","Extrascolaire","37250","MONTBAZON","37154"]
[200800017,"MAIRIE DE JOUE LES TOURS","Ctre Loisirs Stage Multisports","Extrascolaire","37300","JOUE LES TOURS","37122"]
[200800068,"CCAS LA RICHE","Centre de Loisirs TOT'AIME","Extrascolaire","37520","LA RICHE","37195"]
[200900547,"ASSOC BONJOUR LA RECRE","Ctre Loisirs Bonjour La Recré","Extrascolaire","37360","BEAUMONT LOUESTAULT","37021"]
[200900549,"ASSOC LE PETIT PAUSAILLEUR","Ctre de Loisirs Pt Pausailleur","Extrascolaire","37210","VOUVRAY","37281"]
[201100149,"ASSOC UFCV ORLEANS","Centre de Loisirs de Saunay","Extrascolaire","37110","SAUNAY","37240"]
[201100153,"ASSOC UFCV ORLEANS","Centre de Loisirs d'Auzouer","Extrascolaire","37110","AUZOUER EN TOURAINE","37010"]
[201100311,"ASSOC UFCV ORLEANS","Centre de Loisirs Villedomer","Extrascolaire","37110","VILLEDOMER","37276"]
[201200180,"MAIRIE DE LA MEMBROLLE SUR CHOISILLE","Centre de Loisirs la Membrolle","Extrascolaire","37390","MEMBROLLE SUR CHOISILLE","37151"]
[201300011,"COMMUNAUTE DE CNES BLERE VAL DE CHER","Extra Bléré Val de Cher","Extrascolaire","37150","BLERE","37027"]
[201300151,"ASSOC BUL DE MOMES","Extra Nature Prioriterre","Extrascolaire","37400","LUSSAULT SUR LOIRE","37138"]
[201300158,"ASSOC FAMILLES RURALES DU RIDELLOIS","Centre Loisirs B.Vallée Indre","Extrascolaire","37190","RIVARENNES","37200"]
[201400389,"ASSOC FAMILLES RURALES DU RIDELLOIS","Centre de Loisirs de Vallères","Extrascolaire","37190","VALLERES","37264"]
[201400390,"ASSOC MILLE ET UNE PATTES","Centre de Loisirs de Sache","Extrascolaire","37190","SACHE","37205"]
[201400391,"ASSOC MILLE ET UNE PATTES","Centre de Loisirs de Thilouze","Extrascolaire","37260","THILOUZE","37257"]
[201400394,"ASSOC FAMILLES RURALES DE ST PATERNE RACAN","Extra Assoc St Paterne","Extrascolaire","37370","SAINT PATERNE RACAN","37231"]
{"$rows_left_out":145}
{"sheet":"Insee","index":5,"n_rows":280,"n_cols":15,"rows_kept":280,"cut":false,"hidden":true,"merged":[]}
["Commune","Code Postal","Code INSEE","CP Sans Doublon","Commune","Code Postal","Commune","Code Postal","Code INSEE",null,"Commune","Code Postal","Commune","Code Postal","Code INSEE"]
["?????","?????","?????","?????",null,"?????","?????","?????","?????",null,null,{"$f":"LOOKUP(9^9,'[2]Périscolaire Mixte'!D18:D48)","v":{"$error":"#N/A"}}]
["ABILLY",37160,37001,37000]
["AMBILLOU",37340,37002,37100]
["AMBOISE",37400,37003,37110]
["ANCHE",37500,37004,37120]
["ANTOGNY-LE-TILLAC",37800,37005,37130]
["ARTANNES-SUR-INDRE",37260,37006,37140]
["ASSAY",37120,37007,37150]
["ATHEE-SUR-CHER",37270,37008,37160]
["AUTRECHE",37110,37009,37170]
["AUZOUER-EN-TOURAINE",37110,37010,37190]
["AVOINE",37420,37011,37200]
["AVON-LES-ROCHES",37220,37012,37210]
["AVRILLE-LES-PONCEAUX",37340,37013,37220]
["AZAY-LE-RIDEAU",37190,37014,37230]
["AZAY-SUR-CHER",37270,37015,37240]
["AZAY-SUR-INDRE",37310,37016,37250]
["BALLAN-MIRE",37510,37018,37260]
["BARROU",37350,37019,37270]
["BEAULIEU-LES-LOCHES",37600,37020,37290]
["BEAUMONT-EN-VERON",37420,37022,37300]
["BEAUMONT-LOUESTAULT",37360,37021,37310]
["BEAUMONT-LOUESTAULT",37370,37021,37320]
["BEAUMONT-VILLAGE",37460,37023,37330]
["BENAIS",37140,37024,37340]
["BERTHENAY",37510,37025,37350]
["BETZ-LE-CHATEAU",37600,37026,37360]
["BLERE",37150,37027,37370]
["BOSSAY-SUR-CLAISE",37290,37028,37380]
{"$rows_left_out":251}
{"sheet":"Feuil1","index":6,"n_rows":0,"n_cols":0,"rows_kept":0,"cut":false,"hidden":true,"merged":[]}